Target
D-amino-acid oxidase
Ligand
BDBM50393060
Substrate
Meas. Tech.
ChEMBL_853596 (CHEMBL2154051)
IC50
500±n/a nM
Citation
 Berry, JFFerraris, DVDuvall, BHin, NRais, RAlt, JThomas, AGRojas, CHashimoto, KSlusher, BSTsukamoto, T Synthesis and SAR of 1-hydroxy-1H-benzo[d]imidazol-2(3H)-ones as Inhibitors of D-Amino Acid Oxidase. ACS Med Chem Lett 3:839-843 (2012)  
Target
Name:
D-amino-acid oxidase
Synonyms:
D-Amino Acid Oxidase (DAAO) DAMOX OXDA_PIG
Type:
Flavoprotein
Mol. Mass.:
39338.01
Organism:
Sus scrofa (pig)
Description:
Homodimer.
Residue:
347
  
Inhibitor
Name:
BDBM50393060
Synonyms:
CHEMBL2152721
Type:
Small organic molecule
Emp. Form.:
C7H5FN2O2
Mol. Mass.:
168.1252
SMILES:
On1c2cccc(F)c2[nH]c1=O
: