Target
Transmembrane protease serine 6
Ligand
BDBM50394275
Substrate
Meas. Tech.
ChEMBL_856936 (CHEMBL2160579)
IC50
>500000±n/a nM
Citation
 Dosa, SStirnberg, MLülsdorff, VHäußler, DMaurer, EGütschow, M Active site mapping of trypsin, thrombin and matriptase-2 by sulfamoyl benzamidines. Bioorg Med Chem 20:6489-505 (2012)  
Target
Name:
Transmembrane protease serine 6
Synonyms:
Matriptase-2 TMPS6_HUMAN
Type:
PROTEIN
Mol. Mass.:
90001.12
Organism:
Homo sapiens (Human)
Description:
ChEMBL_1442547
Residue:
811
  
Inhibitor
Name:
BDBM50394275
Synonyms:
CHEMBL2159295
Type:
Small organic molecule
Emp. Form.:
C16H17N4O5S
Mol. Mass.:
377.394
SMILES:
NC(=[NH2+])c1ccc(cc1)S(=O)(=O)NCC(=O)Nc1ccc(cc1)C(O)=O
: