Target
Transmembrane protease serine 6
Ligand
BDBM50394321
Substrate
Meas. Tech.
ChEMBL_856936 (CHEMBL2160579)
IC50
>500000±n/a nM
Citation
 Dosa, SStirnberg, MLülsdorff, VHäußler, DMaurer, EGütschow, M Active site mapping of trypsin, thrombin and matriptase-2 by sulfamoyl benzamidines. Bioorg Med Chem 20:6489-505 (2012)  
Target
Name:
Transmembrane protease serine 6
Synonyms:
Matriptase-2 TMPS6_HUMAN
Type:
PROTEIN
Mol. Mass.:
90001.12
Organism:
Homo sapiens (Human)
Description:
ChEMBL_1442547
Residue:
811
  
Inhibitor
Name:
BDBM50394321
Synonyms:
CHEMBL2159366
Type:
Small organic molecule
Emp. Form.:
C14H15N3O3S
Mol. Mass.:
305.352
SMILES:
COc1ccc(NS(=O)(=O)c2ccc(cc2)C(N)=N)cc1
: