Target
Sucrase-isomaltase, intestinal
Ligand
BDBM50394353
Substrate
Meas. Tech.
ChEMBL_857274 (CHEMBL2160769)
IC50
1600±n/a nM
Citation
 Tanabe, GMatsuoka, KYoshinaga, MXie, WTsutsui, NA Amer, MFNakamura, SNakanishi, IWu, XYoshikawa, MMuraoka, O Role of the side chain stereochemistry in thea-glucosidase inhibitory activity of kotalanol, a potent naturala-glucosidase inhibitor. Part 2. Bioorg Med Chem 20:6321-34 (2012)  
Target
Name:
Sucrase-isomaltase, intestinal
Synonyms:
SUIS_RAT Sucrase-isomaltase | alpha-Glucosidase (α-Glucosidase)
Type:
Enzyme
Mol. Mass.:
210329.04
Organism:
Rattus norvegicus (Rat)
Description:
P23739
Residue:
1841
  
Inhibitor
Name:
BDBM50394353
Synonyms:
CHEMBL2159763
Type:
Small organic molecule
Emp. Form.:
C12H24O12S2
Mol. Mass.:
424.442
SMILES:
OC[C@@H](O)[C@H](O)[C@H](O)[C@H](OS([O-])(=O)=O)[C@H](O)C[S@@+]1C[C@@H](O)[C@H](O)[C@H]1CO
: