Target
Urea transporter 1
Ligand
BDBM50394973
Substrate
Meas. Tech.
ChEMBL_858438 (CHEMBL2168840)
IC50
>25000±n/a nM
Citation
 Anderson, MOZhang, JLiu, YYao, CPhuan, PWVerkman, AS Nanomolar potency and metabolically stable inhibitors of kidney urea transporter UT-B. J Med Chem 55:5942-50 (2012)  
Target
Name:
Urea transporter 1
Synonyms:
Slc14a1 UT-B Urea transporter B | Urea transporter, erythrocyte
Type:
PROTEIN
Mol. Mass.:
42130.98
Organism:
Mus musculus
Description:
ChEMBL_964780
Residue:
384
  
Inhibitor
Name:
BDBM50394973
Synonyms:
CHEMBL2165789
Type:
Small organic molecule
Emp. Form.:
C20H21N5O2S2
Mol. Mass.:
427.543
SMILES:
Cc1ccc(cc1C)S(=O)(=O)c1nnn2c3ccsc3c(nc12)N1CCCCC1
: