Target
Mu-type opioid receptor
Ligand
BDBM50395062
Substrate
Meas. Tech.
ChEMBL_859251 (CHEMBL2166336)
Ki
4.8±n/a nM
Citation
 Wang, YXing, YLiu, XJi, HKai, MChen, ZYu, JZhao, DRen, HWang, R A new class of highly potent and selective endomorphin-1 analogues containinga-methylene-ß-aminopropanoic acids (map). J Med Chem 55:6224-36 (2012)  
Target
Name:
Mu-type opioid receptor
Synonyms:
M-OR-1 MOR-1 MUOR1 Mu opiate receptor OPRM1 hMOP | mu-type opioid receptor isoform MOR-1
Type:
G Protein-Coupled Receptor (GPCR)
Mol. Mass.:
44789.51
Organism:
Homo sapiens (Human)
Description:
P35372
Residue:
400
  
Inhibitor
Name:
BDBM50395062
Synonyms:
CHEMBL2163914
Type:
Small organic molecule
Emp. Form.:
C36H40N6O6
Mol. Mass.:
652.7394
SMILES:
COc1ccc(cc1)[C@H](NC(=O)[C@H](Cc1c[nH]c2ccccc12)NC(=O)[C@@H]1CCCN1C(=O)[C@@H](N)Cc1ccc(O)cc1)C(=C)C(N)=O
: