Target
Phosphodiesterase
Ligand
BDBM50397086
Substrate
Meas. Tech.
ChEMBL_863634 (CHEMBL2175366)
IC50
400±n/a nM
Citation
 Orrling, KMJansen, CVu, XLBalmer, VBregy, PShanmugham, AEngland, PBailey, DCos, PMaes, LAdams, Evan den Bogaart, EChatelain, EIoset, JRvan de Stolpe, AZorg, SVeerman, JSeebeck, TSterk, GJde Esch, IJLeurs, R Catechol pyrazolinones as trypanocidals: fragment-based design, synthesis, and pharmacological evaluation of nanomolar inhibitors of trypanosomal phosphodiesterase B1. J Med Chem 55:8745-56 (2012)  
Target
Name:
Phosphodiesterase
Synonyms:
Class 1 phosphodiesterase PDEB1 PDEB1
Type:
Protein
Mol. Mass.:
103683.20
Organism:
Trypanosoma brucei
Description:
Residue:
930
  
Inhibitor
Name:
BDBM50397086
Synonyms:
CHEMBL2171456
Type:
Small organic molecule
Emp. Form.:
C26H32N6O4
Mol. Mass.:
492.5701
SMILES:
COc1ccc(cc1OCCCCOc1ccc(cc1)-c1nnn[nH]1)C1=NN(C(C)C)C(=O)C1(C)C
: