Target
Dual specificity calcium/calmodulin-dependent 3',5'-cyclic nucleotide phosphodiesterase 1C
Ligand
BDBM50397851
Substrate
Meas. Tech.
ChEMBL_876338 (CHEMBL2185812)
IC50
>1000±n/a nM
Citation
 Verhoest, PRFonseca, KRHou, XProulx-Lafrance, CCorman, MHelal, CJClaffey, MMTuttle, JBCoffman, KJLiu, SNelson, FKleiman, RJMenniti, FSSchmidt, CJVanase-Frawley, MLiras, S Design and discovery of 6-[(3S,4S)-4-methyl-1-(pyrimidin-2-ylmethyl)pyrrolidin-3-yl]-1-(tetrahydro-2H-pyran-4-yl)-1,5-dihydro-4H-pyrazolo[3,4-d]pyrimidin-4-one (PF-04447943), a selective brain penetrant PDE9A inhibitor for the treatment of cognitive disorders. J Med Chem 55:9045-54 (2012)  
Target
Name:
Dual specificity calcium/calmodulin-dependent 3',5'-cyclic nucleotide phosphodiesterase 1C
Synonyms:
3',5'-cyclic-AMP phosphodiesterase Calcium/calmodulin-dependent 3',5'-cyclic nucleotide phosphodiesterase 1C Hcam3 PDE1C_HUMAN Phosphodiesterase 1C | Phosphodiesterase, PDE1/PDE5
Type:
Enzyme
Mol. Mass.:
80778.58
Organism:
Homo sapiens (Human)
Description:
Q14123
Residue:
709
  
Inhibitor
Name:
BDBM50397851
Synonyms:
CHEMBL2179094
Type:
Small organic molecule
Emp. Form.:
C22H27N5O2
Mol. Mass.:
393.4821
SMILES:
C[C@@H]1CN(Cc2ccccc2)C[C@H]1c1nc2n(ncc2c(=O)[nH]1)C1CCOCC1
: