Target
Microtubule-associated protein tau
Ligand
BDBM50398203
Substrate
Meas. Tech.
ChEMBL_874179 (CHEMBL2187911)
IC50
2±n/a nM
Citation
 Boländer, AKieser, DVoss, CBauer, SSchön, CBurgold, SBittner, THölzer, JHeyny-von Haußen, RMall, GGoetschy, VCzech, CKnust, HBerger, RHerms, JHilger, ISchmidt, B Bis(arylvinyl)pyrazines, -pyrimidines, and -pyridazines as imaging agents for tau fibrils andß-amyloid plaques in Alzheimer's disease models. J Med Chem 55:9170-80 (2012)  
Target
Name:
Microtubule-associated protein tau
Synonyms:
MAPT MTBT1 Neurofibrillary tangle protein Paired helical filament-tau TAU_HUMAN | Tau Protein
Type:
Protein
Mol. Mass.:
78928.63
Organism:
Homo sapiens (Human)
Description:
P10636
Residue:
758
  
Inhibitor
Name:
BDBM50398203
Synonyms:
CHEMBL2181533
Type:
Small organic molecule
Emp. Form.:
C28H30N4
Mol. Mass.:
422.5646
SMILES:
CN(C)c1ccc(\C=C\C=C\c2cc(\C=C\C=C\c3ccc(cc3)N(C)C)ncn2)cc1
: