Target
Metabotropic glutamate receptor 2
Ligand
BDBM50399089
Substrate
Meas. Tech.
ChEMBL_879037 (CHEMBL2186482)
EC50
944±n/a nM
Citation
 Cid, JMTresadern, GVega, JAde Lucas, AIMatesanz, EIturrino, LLinares, MLGarcia, AAndrés, JIMacdonald, GJOehlrich, DLavreysen, HMegens, AAhnaou, ADrinkenburg, WMackie, CPype, SGallacher, DTrabanco, AA Discovery of 3-cyclopropylmethyl-7-(4-phenylpiperidin-1-yl)-8-trifluoromethyl[1,2,4]triazolo[4,3-a]pyridine (JNJ-42153605): a positive allosteric modulator of the metabotropic glutamate 2 receptor. J Med Chem 55:8770-89 (2012)  
Target
Name:
Metabotropic glutamate receptor 2
Synonyms:
GPRC1B GRM2_HUMAN Metabotropic glutamate receptor mGlu2 | metabotropic glutamate 2
Type:
Enzyme
Mol. Mass.:
95584.88
Organism:
Homo sapiens (Human)
Description:
Q14416
Residue:
872
  
Inhibitor
Name:
BDBM50399089
Synonyms:
CHEMBL2179318
Type:
Small organic molecule
Emp. Form.:
C20H22ClN5
Mol. Mass.:
367.875
SMILES:
Clc1c(ccn2c(CC3CC3)nnc12)N1CCN(CC1)c1ccccc1
: