Target
Glutaminase kidney isoform, mitochondrial
Ligand
BDBM50400060
Substrate
Meas. Tech.
ChEMBL_878001 (CHEMBL2189067)
IC50
10000±n/a nM
Citation
 Shukla, KFerraris, DVThomas, AGStathis, MDuvall, BDelahanty, GAlt, JRais, RRojas, CGao, PXiang, YDang, CVSlusher, BSTsukamoto, T Design, synthesis, and pharmacological evaluation of bis-2-(5-phenylacetamido-1,2,4-thiadiazol-2-yl)ethyl sulfide 3 (BPTES) analogs as glutaminase inhibitors. J Med Chem 55:10551-63 (2012)  
Target
Name:
Glutaminase kidney isoform, mitochondrial
Synonyms:
GLS GLSK_HUMAN K-glutaminase L-glutamine amidohydrolase
Type:
Protein
Mol. Mass.:
73471.89
Organism:
Homo sapiens (Human)
Description:
O94925
Residue:
669
  
Inhibitor
Name:
BDBM50400060
Synonyms:
CHEMBL2177747
Type:
Small organic molecule
Emp. Form.:
C22H31N5O2S
Mol. Mass.:
429.579
SMILES:
O=C(CCCCc1nnc(NC(=O)Cc2ccccc2)s1)NCCN1CCCCC1
: