Target
Fatty-acid amide hydrolase 1
Ligand
BDBM50400835
Substrate
Meas. Tech.
ChEMBL_879293 (CHEMBL2208691)
Ki
2±n/a nM
Citation
 Meanwell, NA Synopsis of some recent tactical application of bioisosteres in drug design. J Med Chem 54:2529-91 (2011)  
Target
Name:
Fatty-acid amide hydrolase 1
Synonyms:
Anandamide amidohydrolase FAAH FAAH1_HUMAN Fatty-acid amide hydrolase (FAAH) Oleamide hydrolase 1
Type:
Protein
Mol. Mass.:
63071.19
Organism:
Homo sapiens (Human)
Description:
O00519
Residue:
579
  
Inhibitor
Name:
BDBM50400835
Synonyms:
CHEMBL219660
Type:
Small organic molecule
Emp. Form.:
C18H21NO3
Mol. Mass.:
299.3642
SMILES:
CC(=O)c1cnc(o1)C(=O)CCCCCCc1ccccc1
: