Target
Serine/threonine-protein kinase PLK1
Ligand
BDBM50402055
Substrate
Meas. Tech.
ChEMBL_886837 (CHEMBL2210941)
Ki
276±n/a nM
Citation
 Zhang, QXia, ZMitten, MJLasko, LMKlinghofer, VBouska, JJohnson, EFPenning, TDLuo, YGiranda, VLShoemaker, ARStewart, KDDjuric, SWVasudevan, A Hit to Lead optimization of a novel class of squarate-containing polo-like kinases inhibitors. Bioorg Med Chem Lett 22:7615-22 (2012)  
Target
Name:
Serine/threonine-protein kinase PLK1
Synonyms:
PLK PLK1 Polo-like kinase 1 (PlK1) STPK13 Serine/threonine-protein kinase 13 | polo-like kinase
Type:
Serine/threonine-protein kinase
Mol. Mass.:
68277.16
Organism:
Homo sapiens (Human)
Description:
P53350
Residue:
603
  
Inhibitor
Name:
BDBM50402055
Synonyms:
CHEMBL2205447
Type:
Small organic molecule
Emp. Form.:
C26H27N5O3
Mol. Mass.:
457.5243
SMILES:
C[C@@H](Nc1c(Nc2ccnc(Nc3ccc(Oc4ccccc4)cc3)n2)c(=O)c1=O)C(C)(C)C
: