Target
Serine/threonine-protein kinase PLK1
Ligand
BDBM50402046
Substrate
Meas. Tech.
ChEMBL_886837 (CHEMBL2210941)
Ki
17±n/a nM
Citation
 Zhang, QXia, ZMitten, MJLasko, LMKlinghofer, VBouska, JJohnson, EFPenning, TDLuo, YGiranda, VLShoemaker, ARStewart, KDDjuric, SWVasudevan, A Hit to Lead optimization of a novel class of squarate-containing polo-like kinases inhibitors. Bioorg Med Chem Lett 22:7615-22 (2012)  
Target
Name:
Serine/threonine-protein kinase PLK1
Synonyms:
PLK PLK1 Polo-like kinase 1 (PlK1) STPK13 Serine/threonine-protein kinase 13 | polo-like kinase
Type:
Serine/threonine-protein kinase
Mol. Mass.:
68277.16
Organism:
Homo sapiens (Human)
Description:
P53350
Residue:
603
  
Inhibitor
Name:
BDBM50402046
Synonyms:
CHEMBL2205466
Type:
Small organic molecule
Emp. Form.:
C19H19N7O2
Mol. Mass.:
377.3999
SMILES:
CC(C)(C)Nc1c(Nc2ccnc(Nc3ccc4[nH]ncc4c3)n2)c(=O)c1=O
: