Target
Prothrombin
Ligand
BDBM50410910
Substrate
Meas. Tech.
ChEMBL_355797 (CHEMBL861145)
Ki
1070±n/a nM
Citation
 Pan, ZJeffery, DAChehade, KBeltman, JClark, JMGrothaus, PBogyo, MBaruch, A Development of activity-based probes for trypsin-family serine proteases. Bioorg Med Chem Lett 16:2882-5 (2006)  
Target
Name:
Prothrombin
Synonyms:
Activation peptide fragment 1 Coagulation factor II Prothrombin precursor Thrombin heavy chain | Thrombin light chain
Type:
Protein
Mol. Mass.:
70029.57
Organism:
Homo sapiens (Human)
Description:
P00734
Residue:
622
  
Inhibitor
Name:
BDBM50410910
Synonyms:
CHEMBL377651
Type:
Small organic molecule
Emp. Form.:
C43H65N6O11PS
Mol. Mass.:
905.049
SMILES:
NCCCC[C@@H](NC(=O)[C@@H]1CCCN1C(=O)CCOCCOCCOCCOCCNC(=O)CCCC[C@@H]1SC[C@@H]2NC(=O)N[C@H]12)P(=O)(Oc1ccccc1)Oc1ccccc1
: