Target
Urotensin-2 receptor
Ligand
BDBM50413763
Substrate
Meas. Tech.
ChEMBL_523640 (CHEMBL998011)
Ki
1.66±n/a nM
Citation
 Grieco, PCarotenuto, ACampiglia, PGomez-Monterrey, IAuriemma, LSala, MMarcozzi, Cd'Emmanuele di Villa Bianca, RBrancaccio, DRovero, PSanticioli, PMeini, SMaggi, CANovellino, E New insight into the binding mode of peptide ligands at Urotensin-II receptor: structure-activity relationships study on P5U and urantide. J Med Chem 52:3927-40 (2009)  
Target
Name:
Urotensin-2 receptor
Synonyms:
G-protein coupled receptor 14 UR-II-R UTS2R Urotensin-II
Type:
Enzyme Catalytic Domain
Mol. Mass.:
42159.71
Organism:
Homo sapiens (Human)
Description:
Urotensin-II UTS2R HUMAN::Q9UKP6
Residue:
389
  
Inhibitor
Name:
BDBM50413763
Synonyms:
CHEMBL448403
Type:
Small organic molecule
Emp. Form.:
C50H66N10O10S2
Mol. Mass.:
1031.25
SMILES:
CC(C)[C@H](NC(=O)[C@@H]1CSSC(C)(C)[C@@H](NC(=O)[C@H](C)N)C(=O)N[C@@H](Cc2ccccc2)C(=O)N[C@H](Cc2c[nH]c3ccccc23)C(=O)N[C@@H](CCCN)C(=O)N[C@@H](Cc2ccc(O)cc2)C(=O)N1)C(O)=O
: