Target
P2X purinoceptor 7
Ligand
BDBM50414309
Substrate
Meas. Tech.
ChEMBL_574385 (CHEMBL1028693)
IC50
0.398±n/a nM
Citation
 Guile, SDAlcaraz, LBirkinshaw, TNBowers, KCEbden, MRFurber, MStocks, MJ Antagonists of the P2X(7) receptor. From lead identification to drug development. J Med Chem 52:3123-41 (2009)  
Target
Name:
P2X purinoceptor 7
Synonyms:
ATP receptor P2RX7_HUMAN P2X purinoceptor 7 (P2X7) P2Z receptor | Purinergic receptor
Type:
Protein
Mol. Mass.:
68602.85
Organism:
Homo sapiens (Human)
Description:
Q99572
Residue:
595
  
Inhibitor
Name:
BDBM50414309
Synonyms:
CHEMBL551362
Type:
Small organic molecule
Emp. Form.:
C22H20F4N2O3
Mol. Mass.:
436.3994
SMILES:
CC(CO)n1ccc2c(NC(=O)Cc3ccc(c(F)c3)C(F)(F)F)c(C)ccc2c1=O
: