Target
P2X purinoceptor 7
Ligand
BDBM50416617
Substrate
Meas. Tech.
ChEMBL_651721 (CHEMBL1228411)
IC50
100±n/a nM
Citation
 Abdi, MHBeswick, PJBillinton, AChambers, LJCharlton, ACollins, SDCollis, KLDean, DKFonfria, EGleave, RJLejeune, CLLivermore, DGMedhurst, SJMichel, ADMoses, APPage, LPatel, SRoman, SASenger, SSlingsby, BSteadman, JGStevens, AJWalter, DS Discovery and structure-activity relationships of a series of pyroglutamic acid amide antagonists of the P2X7 receptor. Bioorg Med Chem Lett 20:5080-4 (2010)  
Target
Name:
P2X purinoceptor 7
Synonyms:
ATP receptor P2RX7_HUMAN P2X purinoceptor 7 (P2X7) P2Z receptor | Purinergic receptor
Type:
Protein
Mol. Mass.:
68602.85
Organism:
Homo sapiens (Human)
Description:
Q99572
Residue:
595
  
Inhibitor
Name:
BDBM50416617
Synonyms:
CHEMBL1222743
Type:
Small organic molecule
Emp. Form.:
C15H17F3N2O2
Mol. Mass.:
314.3029
SMILES:
CCN1[C@@H](CCC1=O)C(=O)NCc1cccc(c1)C(F)(F)F
: