Target
Beta-secretase 1
Ligand
BDBM50305479
Substrate
Meas. Tech.
ChEMBL_715421 (CHEMBL1664806)
IC50
1239±n/a nM
Citation
 Li, ZZhou, MWu, FLi, RDing, Z Self-organizing molecular field analysis on humanß-secretase nonpeptide inhibitors: 5, 5-disubstituted aminohydantoins. Eur J Med Chem 46:58-64 (2010)  
Target
Name:
Beta-secretase 1
Synonyms:
ASP2 Aspartyl protease 2 BACE1 Beta-secretase (BACE) Beta-secretase 1 (BACE 1) Beta-secretase 1 (BACE1) Beta-site amyloid precursor protein cleaving enzyme 1 Memapsin-2 beta-Secretase (BACE-1) | beta-Secretase (BACE1)
Type:
Protein
Mol. Mass.:
55755.10
Organism:
Homo sapiens (Human)
Description:
P56817
Residue:
501
  
Inhibitor
Name:
BDBM50305479
Synonyms:
2-amino-1-benzyl-4-cyclohexyl-4-phenyl-1H-imidazol-5(4H)-one | CHEMBL585215
Type:
Small organic molecule
Emp. Form.:
C22H25N3O
Mol. Mass.:
347.4534
SMILES:
NC1=NC(C2CCCCC2)(C(=O)N1Cc1ccccc1)c1ccccc1
: