Target
Histamine H1 receptor
Ligand
BDBM22567
Substrate
Meas. Tech.
ChEMBL_775917 (CHEMBL1912890)
Ki
4.47±n/a nM
Citation
 Wagner, EWittmann, HJElz, SStrasser, A Mepyramine-JNJ7777120-hybrid compounds show high affinity to hH(1)R, but low affinity to hH(4)R. Bioorg Med Chem Lett 21:6274-80 (2011)  
Target
Name:
Histamine H1 receptor
Synonyms:
H1R HISTAMINE H1 HRH1_HUMAN
Type:
G Protein-Coupled Receptor (GPCR)
Mol. Mass.:
55808.72
Organism:
Homo sapiens (Human)
Description:
Cell pellets from SK-N-MC cells transfected with human H1 receptor were used in binding assay.
Residue:
487
  
Inhibitor
Name:
BDBM22567
Synonyms:
3H]pyrilamine Dorantamin N-(4-methoxybenzyl)-N ,N -dimethyl-N-pyridin-2-ylethane-1,2-diamine PYRILAMINE [3H]mepyramine | [3H]pyrilamine
Type:
radiolabeled ligand
Emp. Form.:
C17H23N3O
Mol. Mass.:
285.384
SMILES:
COc1ccc(CN(CCN(C)C)c2ccccn2)cc1
: