Target
Beta-2 adrenergic receptor
Ligand
BDBM50419688
Substrate
Meas. Tech.
ChEMBL_800676 (CHEMBL1947798)
EC50
0.501187±n/a nM
Citation
 Alcaraz, LBailey, ACadogan, EConnolly, SJewell, RJordan, SKindon, NLister, ALawson, MMullen, ADainty, INicholls, DPaine, SPairaudeau, GStocks, MJThorne, PYoung, A From libraries to candidate: the discovery of new ultra long-acting dibasicß2-adrenoceptor agonists. Bioorg Med Chem Lett 22:689-95 (2011)  
Target
Name:
Beta-2 adrenergic receptor
Synonyms:
ADRB2_CAVPO adrenergic Beta2
Type:
Enzyme Catalytic Domain
Mol. Mass.:
46993.24
Organism:
GUINEA PIG
Description:
adrenergic Beta2 ADRB2 GUINEA PIG::Q8K4Z4
Residue:
418
  
Inhibitor
Name:
BDBM50419688
Synonyms:
CHEMBL1947152
Type:
Small organic molecule
Emp. Form.:
C31H31N3O2S
Mol. Mass.:
509.662
SMILES:
Oc1ccc(CCNCCc2cccc(c2)-c2cccc(CNCc3ccccc3)c2)c2sc(=O)[nH]c12
: