Target
Cannabinoid receptor 2
Ligand
BDBM50308537
Substrate
Meas. Tech.
ChEMBL_338902 (CHEMBL861409)
IC50
0.63±n/a nM
Citation
 Raitio, KHSavinainen, JRVepsäläinen, JLaitinen, JTPoso, AJärvinen, TNevalainen, T Synthesis and SAR studies of 2-oxoquinoline derivatives as CB2 receptor inverse agonists. J Med Chem 49:2022-7 (2006)  
Target
Name:
Cannabinoid receptor 2
Synonyms:
CANNABINOID CB2 CB2 CB2B CNR2_HUMAN Cannabinoid CB2 receptor Cannabinoid receptor 2 (CB2R) | hCB2
Type:
G Protein-Coupled Receptor (GPCR)
Mol. Mass.:
39690.94
Organism:
Homo sapiens (Human)
Description:
P34972
Residue:
360
  
Inhibitor
Name:
BDBM50308537
Synonyms:
7-Methoxy-2-oxo-8-pentyloxy-1,2-dihydroquinoline-3-carboxylic Acid Phenethylamide CHEMBL381314
Type:
Small organic molecule
Emp. Form.:
C24H28N2O4
Mol. Mass.:
408.4901
SMILES:
CCCCCOc1c(OC)ccc2cc(C(=O)NCCc3ccccc3)c(=O)[nH]c12
: