Target
Tyrosine-protein phosphatase non-receptor type 11
Ligand
BDBM50425808
Substrate
Meas. Tech.
ChEMBL_937843 (CHEMBL2317717)
IC50
2200±n/a nM
Citation
 He, YXu, JYu, ZHGunawan, AMWu, LWang, LZhang, ZY Discovery and evaluation of novel inhibitors of mycobacterium protein tyrosine phosphatase B from the 6-Hydroxy-benzofuran-5-carboxylic acid scaffold. J Med Chem 56:832-42 (2013)  
Target
Name:
Tyrosine-protein phosphatase non-receptor type 11
Synonyms:
3.1.3.48 PTP-1D PTP2C Protein Tyrosine Phosphatase PPN11/Shp2 Protein-Tyrosine Phosphatase SHP-2 Protein-tyrosine phosphatase 2C SH-PTP3 SHP2 Src homology phosphatase 2 (SHP-2) Tyrosine-protein phosphatase non-receptor type 11 (SHP-2) | Tyrosine-protein phosphatase non-receptor type 11 (SHP2)
Type:
Protein phosphatase
Mol. Mass.:
68443.59
Organism:
Homo sapiens (Human)
Description:
Q06124
Residue:
593
  
Inhibitor
Name:
BDBM50425808
Synonyms:
CHEMBL2316906
Type:
Small organic molecule
Emp. Form.:
C23H12F2O4
Mol. Mass.:
390.3358
SMILES:
OC(=O)c1cc2c(C#Cc3cc(F)cc(F)c3)c(oc2cc1O)-c1ccccc1
: