Target
Threonine--tRNA ligase 1, cytoplasmic
Ligand
BDBM50426194
Substrate
Meas. Tech.
ChEMBL_935846 (CHEMBL2317882)
Ki
32±n/a nM
Citation
 Teng, MHilgers, MTCunningham, MLBorchardt, ALocke, JBAbraham, SHaley, GKwan, BPHall, CHough, GWShaw, KJFinn, J Identification of bacteria-selective threonyl-tRNA synthetase substrate inhibitors by structure-based design. J Med Chem 56:1748-60 (2013)  
Target
Name:
Threonine--tRNA ligase 1, cytoplasmic
Synonyms:
SYTC_HUMAN TARS1 | Threonyl-tRNA synthetase
Type:
PROTEIN
Mol. Mass.:
83435.65
Organism:
Homo sapiens (Human)
Description:
ChEMBL_935846
Residue:
723
  
Inhibitor
Name:
BDBM50426194
Synonyms:
CHEMBL2316966
Type:
Small organic molecule
Emp. Form.:
C17H21N5O4S
Mol. Mass.:
391.445
SMILES:
CC[C@@H](O)[C@H](N)C(=O)NS(=O)(=O)\C=C\c1cccc(c1)-c1cc(N)ncn1
: