Target
Metabotropic glutamate receptor 5
Ligand
BDBM50429059
Substrate
Meas. Tech.
ChEMBL_943155 (CHEMBL2345731)
IC50
750±n/a nM
Citation
 Son, MHKim, JYLim, EJBaek, DJChoi, KLee, JKPae, ANMin, SJCho, YS Synthesis and biological evaluation of 2-(arylethynyl)quinoline derivatives as mGluR5 antagonists for the treatment of neuropathic pain. Bioorg Med Chem Lett 23:1472-6 (2013)  
Target
Name:
Metabotropic glutamate receptor 5
Synonyms:
GPRC1E GRM5_HUMAN metabotropic glutamate 5 | metabotropic glutamate 5a
Type:
Enzyme
Mol. Mass.:
132484.72
Organism:
Homo sapiens (Human)
Description:
Residue:
1212
  
Inhibitor
Name:
BDBM50429059
Synonyms:
CHEMBL2335295
Type:
Small organic molecule
Emp. Form.:
C16H9BrN2
Mol. Mass.:
309.16
SMILES:
Brc1cccc2nc(ccc12)C#Cc1ccccn1
: