Target
G protein-coupled receptor kinase 5
Ligand
BDBM50429867
Substrate
Meas. Tech.
ChEMBL_944269 (CHEMBL2343919)
IC50
>10000±n/a nM
Citation
 Takeuchi, CSKim, BGBlazey, CMMa, SJohnson, HWAnand, NKArcalas, ABaik, TGBuhr, CACannoy, JEpshteyn, SJoshi, ALara, KLee, MSWang, LLeahy, JWNuss, JMAay, NAoyama, RFoster, PLee, JLehoux, IMunagala, NPlonowski, ARajan, SWoolfrey, JYamaguchi, KLamb, PMiller, N Discovery of a novel class of highly potent, selective, ATP-competitive, and orally bioavailable inhibitors of the mammalian target of rapamycin (mTOR). J Med Chem 56:2218-34 (2013)  
Target
Name:
G protein-coupled receptor kinase 5
Synonyms:
G protein-coupled receptor kinase GRK5 GRK5 | GRK5_HUMAN
Type:
PROTEIN
Mol. Mass.:
67798.93
Organism:
Homo sapiens (Human)
Description:
ChEMBL_1280627
Residue:
590
  
Inhibitor
Name:
BDBM50429867
Synonyms:
CHEMBL2333365
Type:
Small organic molecule
Emp. Form.:
C23H22FN3O4S
Mol. Mass.:
455.502
SMILES:
Cc1c(F)c(ccc1C(=O)N1CCOc2ccc(cc2C1)-c1ccc(N)nc1)S(C)(=O)=O
: