Target
Poly [ADP-ribose] polymerase tankyrase-2
Ligand
BDBM50077325
Substrate
Meas. Tech.
ChEMBL_948352 (CHEMBL2341186)
IC50
870±n/a nM
Citation
 Narwal, MHaikarainen, TFallarero, AVuorela, PMLehtiö, L Screening and structural analysis of flavones inhibiting tankyrases. J Med Chem 56:3507-17 (2013)  
Target
Name:
Poly [ADP-ribose] polymerase tankyrase-2
Synonyms:
(ARTD6 or PARP5b) Poly [ADP-ribose] polymerase tankyrase-2 TNKL TNKS2_HUMAN Tankyrase 2 Tankyrase-2 Tankyrase-2 (TNKS2)
Type:
Enzyme
Mol. Mass.:
126937.16
Organism:
Homo sapiens (Human)
Description:
Q9H2K2
Residue:
1166
  
Inhibitor
Name:
BDBM50077325
Synonyms:
2-(3,4-Dihydroxy-phenyl)-7-hydroxy-chromen-4-one 3',4',7-trihydroxyflavon CHEMBL301624
Type:
Small organic molecule
Emp. Form.:
C15H10O5
Mol. Mass.:
270.2369
SMILES:
Oc1ccc2c(c1)oc(cc2=O)-c1ccc(O)c(O)c1
: