Target
Beta-secretase 2
Ligand
BDBM50432620
Substrate
Meas. Tech.
ChEMBL_950723 (CHEMBL2353184)
IC50
10.0±n/a nM
Citation
 Hilpert, HGuba, WWoltering, TJWostl, WPinard, EMauser, HMayweg, AVRogers-Evans, MHumm, RKrummenacher, DMuser, TSchnider, CJacobsen, HOzmen, LBergadano, ABanner, DWHochstrasser, RKuglstatter, ADavid-Pierson, PFischer, HPolara, ANarquizian, R ß-Secretase (BACE1) inhibitors with high in vivo efficacy suitable for clinical evaluation in Alzheimer's disease. J Med Chem 56:3980-95 (2013)  
Target
Name:
Beta-secretase 2
Synonyms:
AEPLC ASP1 Asp 1 Aspartyl protease 1 BACE2_HUMAN Beta-secretase (BACE) Beta-secretase 2 (BACE-2) Beta-site APP-cleaving enzyme 2 Memapsin-1 beta-Secretase (BACE-2)
Type:
Protein
Mol. Mass.:
56171.20
Organism:
Homo sapiens (Human)
Description:
Q9Y5Z0
Residue:
518
  
Inhibitor
Name:
BDBM50432620
Synonyms:
CHEMBL2347192
Type:
Small organic molecule
Emp. Form.:
C18H16ClF3N4O2
Mol. Mass.:
412.793
SMILES:
Cc1cc(Cl)cnc1C(=O)Nc1ccc(F)c(c1)[C@@]1(C)N=C(N)OCC1(F)F
: