Target
Thioredoxin reductase
Ligand
BDBM50435857
Substrate
Meas. Tech.
ChEMBL_963748 (CHEMBL2395747)
IC50
12500±n/a nM
Citation
 Koch, OJäger, THeller, KKhandavalli, PCPretzel, JBecker, KFlohé, LSelzer, PM Identification of M. tuberculosis thioredoxin reductase inhibitors based on high-throughput docking using constraints. J Med Chem 56:4849-59 (2013)  
Target
Name:
Thioredoxin reductase
Synonyms:
MT4032 TRXB_MYCTU trxB2 | trxR
Type:
PROTEIN
Mol. Mass.:
35636.06
Organism:
Mycobacterium tuberculosis
Description:
ChEMBL_107604
Residue:
335
  
Inhibitor
Name:
BDBM50435857
Synonyms:
CHEMBL2393579
Type:
Small organic molecule
Emp. Form.:
C17H16N2O2
Mol. Mass.:
280.3211
SMILES:
COc1ccc2nc(C)cc(Nc3ccc(O)cc3)c2c1
: