Target
Diacylglycerol O-acyltransferase 1
Ligand
BDBM50437755
Substrate
Meas. Tech.
ChEMBL_973379 (CHEMBL2410085)
IC50
277±n/a nM
Citation
 Kwak, HJPyun, YMKim, JYPagire, HSKim, KYKim, KRRhee, SDJung, WHSong, JSBae, MALee, DHAhn, JH Synthesis and biological evaluation of aminobenzimidazole derivatives with a phenylcyclohexyl acetic acid group as anti-obesity and anti-diabetic agents. Bioorg Med Chem Lett 23:4713-8 (2013)  
Target
Name:
Diacylglycerol O-acyltransferase 1
Synonyms:
DGAT1_MOUSE Dgat1 Diacylglycerol O-acyltransferase 1 (DGAT1) | Diglyceride acyltransferase
Type:
Enzyme
Mol. Mass.:
56810.61
Organism:
Mus musculus (mouse)
Description:
In this assay, recombinant mouse DGAT-1 containing an N-terminal His6-epitope tag was produced in the baculovirus expression system.
Residue:
498
  
Inhibitor
Name:
BDBM50437755
Synonyms:
CHEMBL2409568
Type:
Small organic molecule
Emp. Form.:
C32H26ClF3N4O4
Mol. Mass.:
623.021
SMILES:
OC(=O)CC1CCC(CC1)c1ccc(cc1)-c1nc2ccc(NC(=O)c3nc(oc3C(F)(F)F)-c3ccccc3Cl)cc2[nH]1
: