Target
Coagulation factor X
Ligand
BDBM13592
Substrate
Meas. Tech.
ChEMBL_979044 (CHEMBL2421097)
IC50
35±n/a nM
Citation
 Bolton, SASutton, JCAnumula, RBisacchi, GSJacobson, BSlusarchyk, WATreuner, UDWu, SCZhao, GPi, ZSheriff, SSmirk, RABisaha, SCheney, DLWei, ASchumacher, WAHartl, KSLiu, EZahler, RSeiler, SM Discovery of nonbenzamidine factor VIIa inhibitors using a biaryl acid scaffold. Bioorg Med Chem Lett 23:5239-43 (2013)  
Target
Name:
Coagulation factor X
Synonyms:
Activated coagulation factor X (FXa) Coagulation factor X precursor F10 Factor X heavy chain Factor Xa Stuart-Prower factor
Type:
Enzyme
Mol. Mass.:
54726.60
Organism:
Homo sapiens (Human)
Description:
Residue:
488
  
Inhibitor
Name:
BDBM13592
Synonyms:
2-{2-[(4-carbamimidoylphenyl)carbamoyl]-6-methoxypyridin-3-yl}-5-{[(2S)-1-hydroxy-3,3-dimethylbutan-2-yl]carbamoyl}benzoic acid | Ono Compound 8
Type:
Small organic molecule
Emp. Form.:
C28H31N5O6
Mol. Mass.:
533.5756
SMILES:
COc1ccc(-c2ccc(cc2C(O)=O)C(=O)N[C@H](CO)C(C)(C)C)c(n1)C(=O)Nc1ccc(cc1)C(N)=N
: