Target
E3 ubiquitin-protein ligase XIAP
Ligand
BDBM50441834
Substrate
Meas. Tech.
ChEMBL_988990 (CHEMBL2437636)
IC50
24800±n/a nM
Citation
 Kester, RFDonnell, AFLou, YRemiszewski, SWLombardo, LJChen, SLe, NTLo, JMoliterni, JAHan, XHogg, JHLiang, WMichoud, CRupert, KCMischke, SLe, KWeisel, MJanson, CALukacs, CMFretland, AJHong, KPolonskaia, AGao, LLi, SSolis, DSAguilar, DTardell, CDvorozniak, MTannu, SLee, ECSchutt, ADGoggin, B Optimization of benzodiazepinones as selective inhibitors of the X-linked inhibitor of apoptosis protein (XIAP) second baculovirus IAP repeat (BIR2) domain. J Med Chem 56:7788-803 (2013)  
Target
Name:
E3 ubiquitin-protein ligase XIAP
Synonyms:
API3 E3 ubiquitin-protein ligase XIAP Inhibitor of apoptosis protein 3 X-linked inhibitor of apoptosis XIAP | XIAP_HUMAN
Type:
Protein
Mol. Mass.:
56685.27
Organism:
Homo sapiens (Human)
Description:
P98170
Residue:
497
  
Inhibitor
Name:
BDBM50441834
Synonyms:
CHEMBL2436330 | US10053431, 91a
Type:
Small organic molecule
Emp. Form.:
C32H31BrN4O4
Mol. Mass.:
615.517
SMILES:
CN[C@@H](C)C(=O)N[C@H]1CN(C(=O)c2ccccc2)c2ccccc2N(Cc2c(OC)ccc3cc(Br)ccc23)C1=O
: