Target
Metabotropic glutamate receptor 5
Ligand
BDBM50443088
Substrate
Meas. Tech.
ChEMBL_1276187 (CHEMBL3089425)
IC50
27±n/a nM
Citation
 Kubas, HMeyer, UHechenberger, MKlein, KUPlitt, PZemribo, RSpexgoor, HWvan Assema, SGAbel, U Scaffold hopping approach towards various AFQ-056 analogs as potent metabotropic glutamate receptor 5 negative allosteric modulators. Bioorg Med Chem Lett 23:6370-6 (2013)  
Target
Name:
Metabotropic glutamate receptor 5
Synonyms:
GPRC1E GRM5_HUMAN metabotropic glutamate 5 | metabotropic glutamate 5a
Type:
Enzyme
Mol. Mass.:
132484.72
Organism:
Homo sapiens (Human)
Description:
Residue:
1212
  
Inhibitor
Name:
BDBM50443088
Synonyms:
CHEMBL3087216
Type:
Small organic molecule
Emp. Form.:
C17H18ClNO3
Mol. Mass.:
319.783
SMILES:
COC(=O)N1[C@H]2CC[C@@H]1C[C@](O)(C2)C#Cc1cccc(Cl)c1
: