Target
Cytochrome P450 2D6
Ligand
BDBM50443879
Substrate
Meas. Tech.
ChEMBL_1277839 (CHEMBL3097773)
IC50
6900±n/a nM
Citation
 Fukunaga, KUehara, FAritomo, KShoda, AHiki, SOkuyama, MUsui, YWatanabe, KYamakoshi, KKohara, THanano, TTanaka, HTsuchiya, SSunada, SSaito, KEguchi, JYuki, SAsano, STanaka, SMori, AYamagami, KBaba, HHorikawa, TFujimura, M 2-(2-Phenylmorpholin-4-yl)pyrimidin-4(3H)-ones; a new class of potent, selective and orally active glycogen synthase kinase-3ß inhibitors. Bioorg Med Chem Lett 23:6933-7 (2013)  
Target
Name:
Cytochrome P450 2D6
Synonyms:
CP2D6_HUMAN CYP2DL1 Cytochrome P450 2D6 (CYP2D6) P450-DB1
Type:
Protein
Mol. Mass.:
55774.82
Organism:
Homo sapiens (Human)
Description:
P10635
Residue:
497
  
Inhibitor
Name:
BDBM50443879
Synonyms:
CHEMBL3091538
Type:
Small organic molecule
Emp. Form.:
C20H21N5O3
Mol. Mass.:
379.4124
SMILES:
COc1ccc(cc1)[C@H]1CN(CCO1)c1nc(cc(=O)n1C)-c1ccncn1
: