Target
Cathepsin S
Ligand
BDBM50444317
Substrate
Meas. Tech.
ChEMBL_1278248 (CHEMBL3096507)
IC50
6.0±n/a nM
Citation
 Hilpert, HMauser, HHumm, RAnselm, LKuehne, HHartmann, GGruener, SBanner, DWBenz, JGsell, BKuglstatter, AStihle, MThoma, RSanchez, RAIding, HWirz, BHaap, W Identification of potent and selective cathepsin S inhibitors containing different central cyclic scaffolds. J Med Chem 56:9789-801 (2014)  
Target
Name:
Cathepsin S
Synonyms:
CATS_MOUSE Ctss
Type:
Enzyme
Mol. Mass.:
38476.67
Organism:
Mus musculus (Mouse)
Description:
O70370
Residue:
340
  
Inhibitor
Name:
BDBM50444317
Synonyms:
CHEMBL3093932
Type:
Small organic molecule
Emp. Form.:
C16H16F3N3O3S
Mol. Mass.:
387.377
SMILES:
FC(F)(F)c1ccccc1S(=O)(=O)[C@H]1CN[C@@H](C1)C(=O)NC1(CC1)C#N
: