Target
Ricin
Ligand
BDBM50445073
Substrate
Meas. Tech.
ChEMBL_1282600 (CHEMBL3101399)
IC50
44000±n/a nM
Citation
 Wiget, PAManzano, LAPruet, JMGao, GSaito, RMonzingo, AFJasheway, KRRobertus, JDAnslyn, EV Sulfur incorporation generally improves Ricin inhibition in pterin-appended glycine-phenylalanine dipeptide mimics. Bioorg Med Chem Lett 23:6799-804 (2014)  
Target
Name:
Ricin
Synonyms:
RICI_RICCO
Type:
PROTEIN
Mol. Mass.:
64090.82
Organism:
Ricinus communis
Description:
ChEMBL_1286970
Residue:
576
  
Inhibitor
Name:
BDBM50445073
Synonyms:
CHEMBL3098911
Type:
Small organic molecule
Emp. Form.:
C17H17N7O3
Mol. Mass.:
367.362
SMILES:
Nc1nc2nc(cnc2c(=O)[nH]1)C(=O)NCCNC(=O)Cc1ccccc1
: