Target
ATP-dependent 6-phosphofructokinase
Ligand
BDBM50029770
Substrate
Meas. Tech.
ChEMBL_1288121 (CHEMBL3110581)
IC50
>57000±n/a nM
Citation
 Brimacombe, KRWalsh, MJLiu, LVásquez-Valdivieso, MGMorgan, HPMcNae, IFothergill-Gilmore, LAMichels, PAAuld, DSSimeonov, AWalkinshaw, MDShen, MBoxer, MB Identification of ML251, a Potent Inhibitor of T. brucei and T. cruzi Phosphofructokinase. ACS Med Chem Lett 5:12-7 (2014)  
Target
Name:
ATP-dependent 6-phosphofructokinase
Synonyms:
6-phospho-1-fructokinase pfk
Type:
PROTEIN
Mol. Mass.:
53537.94
Organism:
Trypanosoma brucei
Description:
ChEMBL_1288121
Residue:
487
  
Inhibitor
Name:
BDBM50029770
Synonyms:
4-amino-N-(5-methyl-isoxazol-3-yl)-benzenesulfonamide ACETYLSULFAMETHOXAZOLE CHEMBL443 GANTANOL RO 4-2130 SULFAMETHOPRIM SULFAMETHOXAZOLE SODIUM SULFATRIM-DS SULMEPRIM TRIMETH/SULFA | UROBAK
Type:
Small organic molecule
Emp. Form.:
C10H11N3O3S
Mol. Mass.:
253.278
SMILES:
Cc1cc(NS(=O)(=O)c2ccc(N)cc2)no1
: