Target
Protein arginine N-methyltransferase 1
Ligand
BDBM50448486
Substrate
Meas. Tech.
ChEMBL_1294380 (CHEMBL3129165)
IC50
300000±n/a nM
Citation
 Valente, SLiu, YSchnekenburger, MZwergel, CCosconati, SGros, CTardugno, MLabella, DFlorean, CMinden, SHashimoto, HChang, YZhang, XKirsch, GNovellino, EArimondo, PBMiele, EFerretti, EGulino, ADiederich, MCheng, XMai, A Selective non-nucleoside inhibitors of human DNA methyltransferases active in cancer including in cancer stem cells. J Med Chem 57:701-13 (2014)  
Target
Name:
Protein arginine N-methyltransferase 1
Synonyms:
ANM1_RAT Hrmt1l2 | Prmt1
Type:
PROTEIN
Mol. Mass.:
40514.94
Organism:
Rattus norvegicus
Description:
ChEMBL_103589
Residue:
353
  
Inhibitor
Name:
BDBM50448486
Synonyms:
CHEMBL3126644
Type:
Small organic molecule
Emp. Form.:
C27H23N7O
Mol. Mass.:
461.5178
SMILES:
Cc1cc(Nc2ccccc2NC(=O)c2ccc(Nc3ccnc4ccccc34)cc2)nc(N)n1
: