Target
Coagulation factor X
Ligand
BDBM13663
Substrate
Meas. Tech.
ChEBML_48815
Ki
13±n/a nM
Citation
 Nazaré, MMatter, HKlingler, OAl-Obeidi, FSchreuder, HZoller, GCzech, JLorenz, MDudda, APeyman, ANestler, HPUrmann, MBauer, ALaux, VWehner, VWill, DW Novel factor Xa inhibitors based on a benzoic acid scaffold and incorporating a neutral P1 ligand. Bioorg Med Chem Lett 14:2801-5 (2004)  
Target
Name:
Coagulation factor X
Synonyms:
Activated coagulation factor X (FXa) Coagulation factor X precursor F10 Factor X heavy chain Factor Xa Stuart-Prower factor
Type:
Enzyme
Mol. Mass.:
54726.60
Organism:
Homo sapiens (Human)
Description:
Residue:
488
  
Inhibitor
Name:
BDBM13663
Synonyms:
3-Oxybenzamide 49 | 3-[2-(2,4-dichlorophenyl)ethoxy]-5-methoxy-4-methyl-N-{[1-(pyridin-4-yl)piperidin-4-yl]methyl}benzamide
Type:
Small organic molecule
Emp. Form.:
C28H31Cl2N3O3
Mol. Mass.:
528.47
SMILES:
COc1cc(cc(OCCc2ccc(Cl)cc2Cl)c1C)C(=O)NCC1CCN(CC1)c1ccncc1
: