Target
Endoplasmin
Ligand
BDBM50003887
Substrate
Meas. Tech.
ChEMBL_1336950 (CHEMBL3242258)
Ki
420±n/a nM
Citation
 Ernst, JTNeubert, TLiu, MSperry, SZuccola, HTurnbull, AFleck, BKargo, WWoody, LChiang, PTran, DChen, WSnyder, PAlcacio, TNezami, AReynolds, JAlvi, KGoulet, LStamos, D Identification of novel HSP90a/ß isoform selective inhibitors using structure-based drug design. demonstration of potential utility in treating CNS disorders such as Huntington's disease. J Med Chem 57:3382-400 (2014)  
Target
Name:
Endoplasmin
Synonyms:
94 kDa glucose-regulated protein GRP-94 Glucose regulated protein 94kDa (Grp94) Heat shock protein 90 kDa beta member 1 Tumor rejection antigen 1 | gp96 homolog
Type:
Protein
Mol. Mass.:
92417.36
Organism:
Homo sapiens (Human)
Description:
P14625
Residue:
803
  
Inhibitor
Name:
BDBM50003887
Synonyms:
CHEMBL3235338
Type:
Small organic molecule
Emp. Form.:
C26H34N4O2S
Mol. Mass.:
466.639
SMILES:
CN1CCc2c(C1)n(c1CC(C)(C)CC(=O)c21)-c1ccc(C(N)=O)c(NC2CCSCC2)c1
: