Target
Endoplasmin
Ligand
BDBM50003878
Substrate
Meas. Tech.
ChEMBL_1336950 (CHEMBL3242258)
Ki
>10000±n/a nM
Citation
 Ernst, JTNeubert, TLiu, MSperry, SZuccola, HTurnbull, AFleck, BKargo, WWoody, LChiang, PTran, DChen, WSnyder, PAlcacio, TNezami, AReynolds, JAlvi, KGoulet, LStamos, D Identification of novel HSP90a/ß isoform selective inhibitors using structure-based drug design. demonstration of potential utility in treating CNS disorders such as Huntington's disease. J Med Chem 57:3382-400 (2014)  
Target
Name:
Endoplasmin
Synonyms:
94 kDa glucose-regulated protein GRP-94 Glucose regulated protein 94kDa (Grp94) Heat shock protein 90 kDa beta member 1 Tumor rejection antigen 1 | gp96 homolog
Type:
Protein
Mol. Mass.:
92417.36
Organism:
Homo sapiens (Human)
Description:
P14625
Residue:
803
  
Inhibitor
Name:
BDBM50003878
Synonyms:
CHEMBL3235362
Type:
Small organic molecule
Emp. Form.:
C26H25FN2O2
Mol. Mass.:
416.4873
SMILES:
Cc1cn(c2CC(C)(C)CC(=O)c12)-c1cc2CCNC(=O)c2c(c1)-c1cccc(F)c1
: