Target
Neprilysin
Ligand
BDBM50005641
Substrate
Meas. Tech.
ChEMBL_1339909 (CHEMBL3243746)
IC50
>100000±n/a nM
Citation
 Charton, JGauriot, MGuo, QHennuyer, NMarechal, XDumont, JHamdane, MPottiez, VLandry, VSperandio, OFlipo, MBuee, LStaels, BLeroux, FTang, WJDeprez, BDeprez-Poulain, R Imidazole-derived 2-[N-carbamoylmethyl-alkylamino]acetic acids, substrate-dependent modulators of insulin-degrading enzyme in amyloid-ß hydrolysis. Eur J Med Chem 79:184-93 (2014)  
Target
Name:
Neprilysin
Synonyms:
Atriopeptidase CD_antigen=CD10 EPN MME NEP_HUMAN Neutral endopeptidase | Neutral endopeptidase 24.11
Type:
Enzyme
Mol. Mass.:
85505.38
Organism:
Homo sapiens (Human)
Description:
P08473
Residue:
750
  
Inhibitor
Name:
BDBM50005641
Synonyms:
CHEMBL3235416
Type:
Small organic molecule
Emp. Form.:
C20H27N5O4
Mol. Mass.:
401.4595
SMILES:
CNC(=O)[C@H](Cc1c[nH]cn1)NC(=O)CN(CCCc1ccccc1)CC(O)=O
: