Target
Sodium channel protein type 3 subunit alpha
Ligand
BDBM50008746
Substrate
Meas. Tech.
ChEMBL_1336351 (CHEMBL3242059)
IC50
>100000±n/a nM
Citation
 Browne, LLidster, KAl-Izki, SClutterbuck, LPosada, CChan, AWRiddall, DGarthwaite, JBaker, DSelwood, DL Imidazol-1-ylethylindazole voltage-gated sodium channel ligands are neuroprotective during optic neuritis in a mouse model of multiple sclerosis. J Med Chem 57:2942-52 (2014)  
Target
Name:
Sodium channel protein type 3 subunit alpha
Synonyms:
KIAA1356 NAC3 SCN3A_HUMAN Sodium channel alpha subunits; brain (Types I, II, III) Voltage-gated sodium channel subunit alpha Nav1.3 (Nav1.3)
Type:
Protein
Mol. Mass.:
226276.42
Organism:
Homo sapiens (Human)
Description:
Q9NY46
Residue:
2000
  
Inhibitor
Name:
BDBM50008746
Synonyms:
CHEMBL3236343
Type:
Small organic molecule
Emp. Form.:
C22H19N7O2
Mol. Mass.:
413.432
SMILES:
O=C(NCc1noc(n1)-c1nn(CCn2ccnc2)c2ccccc12)c1ccccc1
: