Target
Sodium channel protein type 5 subunit alpha
Ligand
BDBM50008746
Substrate
Meas. Tech.
ChEMBL_1336362 (CHEMBL3242070)
IC50
69000±n/a nM
Citation
 Browne, LLidster, KAl-Izki, SClutterbuck, LPosada, CChan, AWRiddall, DGarthwaite, JBaker, DSelwood, DL Imidazol-1-ylethylindazole voltage-gated sodium channel ligands are neuroprotective during optic neuritis in a mouse model of multiple sclerosis. J Med Chem 57:2942-52 (2014)  
Target
Name:
Sodium channel protein type 5 subunit alpha
Synonyms:
HH1 SCN5A_HUMAN Sodium channel protein type 5 subunit alpha/beta-1/beta-2 Voltage-gated sodium channel subunit alpha Nav1.5
Type:
Enzyme
Mol. Mass.:
226908.60
Organism:
Homo sapiens (Human)
Description:
Q14524
Residue:
2016
  
Inhibitor
Name:
BDBM50008746
Synonyms:
CHEMBL3236343
Type:
Small organic molecule
Emp. Form.:
C22H19N7O2
Mol. Mass.:
413.432
SMILES:
O=C(NCc1noc(n1)-c1nn(CCn2ccnc2)c2ccccc12)c1ccccc1
: