Target
Sodium channel protein type 9 subunit alpha
Ligand
BDBM50008745
Substrate
Meas. Tech.
ChEMBL_1336371 (CHEMBL3242220)
IC50
5640±n/a nM
Citation
 Browne, LLidster, KAl-Izki, SClutterbuck, LPosada, CChan, AWRiddall, DGarthwaite, JBaker, DSelwood, DL Imidazol-1-ylethylindazole voltage-gated sodium channel ligands are neuroprotective during optic neuritis in a mouse model of multiple sclerosis. J Med Chem 57:2942-52 (2014)  
Target
Name:
Sodium channel protein type 9 subunit alpha
Synonyms:
NENA Peripheral sodium channel 1 SCN9A_HUMAN Voltage-gated sodium channel subunit Nav1.7 hNE-Na
Type:
Protein
Mol. Mass.:
226375.97
Organism:
Homo sapiens (Human)
Description:
Q15858
Residue:
1988
  
Inhibitor
Name:
BDBM50008745
Synonyms:
CHEMBL3236329
Type:
Small organic molecule
Emp. Form.:
C23H18F3N7O3
Mol. Mass.:
497.4293
SMILES:
FC(F)(F)Oc1cccc(c1)C(=O)NCc1noc(n1)-c1n(CCn2ccnc2)nc2ccccc12
: