Target
Histone deacetylase 1
Ligand
BDBM50020899
Substrate
Meas. Tech.
ChEMBL_1364645 (CHEMBL3291778)
IC50
110±n/a nM
Citation
 Chen, FChai, HSu, MBZhang, YMLi, JXie, XNan, FJ Potent and orally efficacious bisthiazole-based histone deacetylase inhibitors. ACS Med Chem Lett 5:628-33 (2014)  
Target
Name:
Histone deacetylase 1
Synonyms:
Cereblon/Histone deacetylase 1 HDAC1 Histone deacetylase 1 (HDAC1) RPD3L1
Type:
Enzyme
Mol. Mass.:
55090.27
Organism:
Homo sapiens (Human)
Description:
Q13547
Residue:
482
  
Inhibitor
Name:
BDBM50020899
Synonyms:
CHEMBL3287257 | US9216962, CFH403
Type:
Small organic molecule
Emp. Form.:
C18H18N4O3S2
Mol. Mass.:
402.491
SMILES:
ONC(=O)CCCCNC(=O)c1nc(sc1-c1ccccc1)-c1nccs1
: