Target
Histone deacetylase 1
Ligand
BDBM50020906
Substrate
Meas. Tech.
ChEMBL_1364645 (CHEMBL3291778)
IC50
170±n/a nM
Citation
 Chen, FChai, HSu, MBZhang, YMLi, JXie, XNan, FJ Potent and orally efficacious bisthiazole-based histone deacetylase inhibitors. ACS Med Chem Lett 5:628-33 (2014)  
Target
Name:
Histone deacetylase 1
Synonyms:
Cereblon/Histone deacetylase 1 HDAC1 Histone deacetylase 1 (HDAC1) RPD3L1
Type:
Enzyme
Mol. Mass.:
55090.27
Organism:
Homo sapiens (Human)
Description:
Q13547
Residue:
482
  
Inhibitor
Name:
BDBM50020906
Synonyms:
CHEMBL3287264
Type:
Small organic molecule
Emp. Form.:
C16H20N4O3S2
Mol. Mass.:
380.485
SMILES:
[#6]\[#6](-[#6])=[#6]/c1sc(nc1-[#6](=O)-[#7]-[#6]-[#6]-[#6]-[#6]-[#6](=O)-[#7]-[#8])-c1nccs1
: