Target
Histone deacetylase 3
Ligand
BDBM50020896
Substrate
Meas. Tech.
ChEMBL_1364647 (CHEMBL3291780)
IC50
190±n/a nM
Citation
 Chen, FChai, HSu, MBZhang, YMLi, JXie, XNan, FJ Potent and orally efficacious bisthiazole-based histone deacetylase inhibitors. ACS Med Chem Lett 5:628-33 (2014)  
Target
Name:
Histone deacetylase 3
Synonyms:
HD3 HDAC3_HUMAN Human HDAC3 SMAP45
Type:
Enzyme
Mol. Mass.:
48829.55
Organism:
Homo sapiens (Human)
Description:
O15379
Residue:
428
  
Inhibitor
Name:
BDBM50020896
Synonyms:
CHEMBL3287254 | US9216962, CFH383
Type:
Small organic molecule
Emp. Form.:
C16H22N4O3S2
Mol. Mass.:
382.501
SMILES:
CCCCc1sc(nc1C(=O)NCCCCC(=O)NO)-c1nccs1
: