Target
Potassium/sodium hyperpolarization-activated cyclic nucleotide-gated channel 4
Ligand
BDBM50395399
Substrate
Meas. Tech.
ChEMBL_1454251 (CHEMBL3363801)
IC50
>100000±n/a nM
Citation
 Reck, FEhmann, DEDougherty, TJNewman, JVHopkins, SStone, GAgrawal, NCiaccio, PMcNulty, JBarthlow, HO'Donnell, JGoteti, KBreen, JComita-Prevoir, JCornebise, MCronin, MEyermann, CJGeng, BCarr, GRPandarinathan, LTang, XCottone, AZhao, LBezdenejnih-Snyder, N Optimization of physicochemical properties and safety profile of novel bacterial topoisomerase type II inhibitors (NBTIs) with activity against Pseudomonas aeruginosa. Bioorg Med Chem 22:5392-409 (2014)  
Target
Name:
Potassium/sodium hyperpolarization-activated cyclic nucleotide-gated channel 4
Synonyms:
HCN4 | HCN4_HUMAN
Type:
PROTEIN
Mol. Mass.:
129069.19
Organism:
Homo sapiens (Human)
Description:
ChEMBL_1454251
Residue:
1203
  
Inhibitor
Name:
BDBM50395399
Synonyms:
CHEMBL2165063
Type:
Small organic molecule
Emp. Form.:
C24H28N6O4
Mol. Mass.:
464.5169
SMILES:
COc1ccc2ncc(=O)n(CCN3CCC(CC3)NCc3ccc4OCC(=O)Nc4n3)c2c1
: