Target
Free fatty acid receptor 2
Ligand
BDBM50032443
Substrate
Meas. Tech.
ChEMBL_1440135 (CHEMBL3382548)
IC50
116±n/a nM
Citation
 Pizzonero, MDupont, SBabel, MBeaumont, SBienvenu, NBlanqué, RCherel, LChristophe, TCrescenzi, BDe Lemos, EDelerive, PDeprez, PDe Vos, SDjata, FFletcher, SKopiejewski, SL'Ebraly, CLefrançois, JMLavazais, SManioc, MNelles, LOste, LPolancec, DQuénéhen, VSoulas, FTriballeau, Nvan der Aar, EMVandeghinste, NWakselman, EBrys, RSaniere, L Discovery and optimization of an azetidine chemical series as a free fatty acid receptor 2 (FFA2) antagonist: from hit to clinic. J Med Chem 57:10044-57 (2014)  
Target
Name:
Free fatty acid receptor 2
Synonyms:
FFA2 FFAR2_HUMAN GPCR43 | GPR43
Type:
PROTEIN
Mol. Mass.:
37156.44
Organism:
Homo sapiens (Human)
Description:
ChEMBL_1508993
Residue:
330
  
Inhibitor
Name:
BDBM50032443
Synonyms:
CHEMBL3353539
Type:
Small organic molecule
Emp. Form.:
C28H28N2O6
Mol. Mass.:
488.5317
SMILES:
CC1(CCN1C(=O)Cc1coc2ccccc12)C(=O)N(CCCC(O)=O)Cc1ccc2ccoc2c1
: